{"text_format":"3","workbook":"xlsx","n_sheets":9,"sheets":["Life expectancy results","Printable Explanations","Explanations","Super secret parameters","Calcs","working tables","Mortality tables","Notes","Version control"],"not_rendered":{"images":9,"macros":1,"defined_names":107,"comments":3},"read":"whole","date_system":"1900"}

{"sheet":"Life expectancy results","index":0,"n_rows":17,"n_cols":11,"rows_kept":17,"merged":[[0,0,0,12],[9,8,9,11],[14,1,14,7],[15,1,15,7],[16,1,16,7]]}
["Life Expectancy Calculator"]
[null,"Input",{"$nulls":6},"Life expectancy"]
[{"$nulls":8},{"$f":"life_expect","v":{"v":16.214281821854378,"d":"16.2"}}]
[{"$nulls":9},"Number of Future Years","Probability of Survival"]
[null,{"$f":"IF(couple?,\"Person 1\",\"\")","v":""},{"$nulls":7},{"$f":"IF(display1,IF(opt_display=\"pct\",t_pct_1,IF(couple?,yrs_c_1,yrs_1)),\"\")","v":{"v":16.510026532052674,"d":"17"}},{"$f":"IF(display1,IF(opt_display=\"pct\",1-pct_1,prob_yrs_1),\"\")","v":{"v":0.5,"d":"50%"}}]
[null,"Age:",67,"Sex:","M",{"$nulls":4},{"$f":"IF(display2,IF(opt_display=\"pct\",t_pct_2,IF(couple?,yrs_c_2,yrs_2)),\"\")","v":{"v":18.804085957543133,"d":"19"}},{"$f":"IF(display2,IF(opt_display=\"pct\",1-pct_2,prob_yrs_2),\"\")","v":{"v":0.4,"d":"40%"}}]
[null,{"$f":"IF(couple?,\"Person 2\",\"\")","v":""},{"$nulls":7},{"$f":"IF(display3,IF(opt_display=\"pct\",t_pct_3,IF(couple?,yrs_c_3,yrs_3)),\"\")","v":{"v":21.115243856862296,"d":"21"}},{"$f":"IF(display3,IF(opt_display=\"pct\",1-pct_3,prob_yrs_3),\"\")","v":{"v":0.30000000000000004,"d":"30%"}}]
[null,{"$f":"IF(couple?,\"Age:\",\"\")","v":""},85,{"$f":"IF(couple?,\"Sex:\",\"\")","v":""},"F",{"$nulls":4},{"$f":"IF(display4,IF(opt_display=\"pct\",t_pct_4,IF(couple?,yrs_c_4,yrs_4)),\"\")","v":{"v":23.612743113734204,"d":"24"}},{"$f":"IF(display4,IF(opt_display=\"pct\",1-pct_4,prob_yrs_4),\"\")","v":{"v":0.19999999999999996,"d":"20%"}}]
[{"$nulls":9},{"$f":"IF(display5,IF(opt_display=\"pct\",t_pct_5,IF(couple?,yrs_c_5,yrs_5)),\"\")","v":{"v":26.74142730118313,"d":"27"}},{"$f":"IF(display5,IF(opt_display=\"pct\",1-pct_5,prob_yrs_5),\"\")","v":{"v":0.09999999999999998,"d":"10%"}}]
[{"$nulls":8},{"$f":"table_source_text","v":"Table source: Social Security 2011 tables with no mortality improvement"}]
[]
[]
[]
[]
[null,"Click here for disclaimer"]
[null,"Created by Mary Pat Campbell, FSA, updated May 2014"]
[null,"Updated October 2015 by Retirement Rocket Science"]

{"sheet":"Printable Explanations","index":1,"n_rows":55,"n_cols":6,"rows_kept":55,"merged":[[0,0,0,7],[2,0,2,3],[2,5,16,7],[9,0,9,1],[11,0,11,3],[12,0,12,1],[13,0,13,1],[14,0,14,1],[15,0,15,1],[16,0,16,1],[17,0,17,1],[17,5,21,7],[19,0,19,3],[20,0,20,1],[21,0,21,1],[22,0,22,1],[22,5,26,7],[23,0,23,1],[24,0,24,1],[25,0,25,1],[27,5,34,7],[28,0,28,3],[29,0,37,3],[36,5,36,7],[37,5,56,7],[39,0,39,3],[40,0,49,3]]}
["Simple Life Expectancy Calculator"]
[]
[{"$f":"\"Results for a\"&IF(couple?,\" couple:\",\"n individual:\")","v":"Results for an individual:"},{"$nulls":4},{"$f":"\"     \"&IndividualString1&\"\n\n     \"&IndividualString2","v":"     The calculations presented in this tool are intended for educational purposes, as most people do not have a good feel for how long they may live in retirement. The calculations presented are based on public mortality tables, which were developed with certain populations in mind, and reflect probabilities based on averages in large populations.\n\n     An individual's survival probabilities are dependent on factors such as family history, personal lifestyle (such as smoking or diet), existing disease (such as diabetes), and the like; one needs to take that into consideration when trying to consider how to use these numbers for their own retirement planning."}]
[{"$f":"IF(couple?,\"Age of first person:\",\"Age:\")","v":"Age:"},{"$f":"_age1","v":67},{"$f":"IF(couple?,\"Sex of first person:\",\"Sex:\")","v":"Sex:"},{"$f":"IF(_sex1=\"M\",\"Male\",\"Female\")","v":"Male"}]
[{"$f":"IF(couple?,\"Age of second person:\",\"\")","v":""},{"$f":"IF(couple?,_age2,\"\")","v":""},{"$f":"IF(couple?,\"Sex of second person:\",\"\")","v":""},{"$f":"IF(couple?,IF(_sex2=\"M\",\"Male\",\"Female\"),\"\")","v":""}]
[]
["Mortality tables used:",{"$f":"Explanations!B17","v":"Social Security Calendar Year 2011"}]
["Mortality improvement:",{"$f":"IF(mort_improve_rate=0,\"none\",TEXT(proj_rate,\"0%\")&\" per year\")","v":"none"}]
[]
["Life expectancy:",null,{"$f":"life_expect","v":{"v":16.214281821854378,"d":"16.2"}}]
[]
["Survival probabilities for set number of years"]
["Number of future years",null,"Probability of survival"]
[{"$f":"IF(displayy1,years1,\"\")","v":10},null,{"$f":"IF(A14=\"\",\"\",prob_yrs_1)","v":{"v":0.7510112790584232,"d":"75%"}}]
[{"$f":"IF(displayy2,years2,\"\")","v":15},null,{"$f":"IF(A15=\"\",\"\",prob_yrs_2)","v":{"v":0.5641759743488866,"d":"56%"}}]
[{"$f":"IF(displayy3,years3,\"\")","v":20},null,{"$f":"IF(A16=\"\",\"\",prob_yrs_3)","v":{"v":0.3477942896316461,"d":"35%"}}]
[{"$f":"IF(displayy4,years4,\"\")","v":25},null,{"$f":"IF(A17=\"\",\"\",prob_yrs_4)","v":{"v":0.1509478723157642,"d":"15%"}}]
[{"$f":"IF(displayy5,years5,\"\")","v":""},null,{"$f":"IF(A18=\"\",\"\",prob_yrs_5)","v":""},null,null,{"$f":"\"     \"&IF(couple?,couple_calc_explain,single_calc_explain)","v":"     All probabilities and averages are computed taking into account your age and sex, using the Social Security Calendar Year 2011 mortality table, with mortality rates assumed to be constant."}]
[]
["Number of Future Years for set percentiles"]
{"$rows_left_out":26}
{"sheet":"Explanations","index":2,"n_rows":47,"n_cols":2,"rows_kept":47,"merged":[[1,0,5,0],[9,0,13,0]]}
["Explanation of cals:"]
["Explanation of calcs for single:",{"$f":"\"All probabilities and averages are computed taking into account your age and sex, using \"&table_string&\" mortality table,\"&mort_improve_text&\".\"","v":"All probabilities and averages are computed taking into account your age and sex, using the Social Security Calendar Year 2011 mortality table, with mortality rates assumed to be constant."}]
[null,{"$f":"\"The life expectancy is the average number of years until death.\"","v":"The life expectancy is the average number of years until death."}]
[null,{"$f":"\"  In this illustration, life expectancy is \"&ROUND(life_expect,1)&\", which means on average you would expect to live \"&ROUND(life_expect,1)&\" more years.\"","v":"  In this illustration, life expectancy is 16.2, which means on average you would expect to live 16.2 more years."}]
[null,{"$f":"\"The ages and probabilities displayed indicate the probability of surviving to that many years.\"","v":"The ages and probabilities displayed indicate the probability of surviving to that many years."}]
[null,{"$f":"IF(display1,\"  For example, the information in the first row means that, of people currently age \"&_age1&\", \"&ROUND('Life expectancy results'!K5*100,0)&\"% will be expected to be alive in \"&ROUND('Life expectancy results'!J5,0)&\" more years.\",\"\")","v":"  For example, the information in the first row means that, of people currently age 67, 50% will be expected to be alive in 17 more years."}]
[]
[]
[]
["Explanation of calcs for Couple:",{"$f":"\"All probabilities and averages are computed taking into account your ages and sexes, using \"&table_string&\" mortality table,\"&mort_improve_text&\".\"","v":"All probabilities and averages are computed taking into account your ages and sexes, using the Social Security Calendar Year 2011 mortality table, with mortality rates assumed to be constant."}]
[null,{"$f":"\"The life expectancy is the average number of years until the last death in the couple.\"","v":"The life expectancy is the average number of years until the last death in the couple."}]
[null,{"$f":"\"  In this illustration, life expectancy is \"&ROUND(life_expect,1)&\", which means on average you would expect the last person in the couple to die in \"&ROUND(life_expect,1)&\" more years.\"","v":"  In this illustration, life expectancy is 16.2, which means on average you would expect the last person in the couple to die in 16.2 more years."}]
[null,{"$f":"\"The ages and probabilities displayed indicate the probability of at least one member of the couple surviving to that age.\"","v":"The ages and probabilities displayed indicate the probability of at least one member of the couple surviving to that age."}]
[null,{"$f":"IF(display1,\"  For example, the information in the first row means that, of couples currently aged \"&_age1&\" and \"&_age2&\", \"&ROUND('Life expectancy results'!K5*100,0)&\"% will be expected to have at least one member alive in \"&ROUND('Life expectancy results'!J5,0)&\" years from now.\",\"\")","v":"  For example, the information in the first row means that, of couples currently aged 67 and 85, 50% will be expected to have at least one member alive in 17 years from now."}]
[]
[]
["Table name:",{"$f":"IF(table_set = \"ann\",\"2012 Individual Annuitant Mortality\", \"Social Security Calendar Year 2011\")","v":"Social Security Calendar Year 2011"}]
[null,{"$f":"\"the \"&B17","v":"the Social Security Calendar Year 2011"}]
[]
["Begin table source:",{"$f":"IF(table_set=\"ann\",\"Table source: 2012 Individual Annuitant Mortality tables\",\"Table source: Social Security 2011 tables\")","v":"Table source: Social Security 2011 tables"}]
{"$rows_left_out":28}
{"sheet":"Super secret parameters","index":3,"n_rows":13,"n_cols":8,"rows_kept":13}
[{"$nulls":6},"Table set","ss"]
["Male mortality table:",{"$f":"IF(table_set=\"ann\",\"2581\",\"SSM\")","v":"SSM"}]
["Female mortality table:",{"$f":"IF(table_set=\"ann\",\"2582\",\"SSF\")","v":"SSF"}]
[{"$nulls":6},"Type","Assumption"]
["Interpolation choice:","lin",{"$nulls":4},"linear","uniform distribution of deaths"]
[{"$nulls":6},"exponential","constant force of mortality"]
["Show:","pct",{"$nulls":4},"harmonic","hyperbolic; Balducci's assumption"]
["Percentiles to show:",1,2,3,4,5]
[null,{"$f":"IF(couple?,30%,50%)","v":{"v":0.5,"d":"50%"}},{"$f":"IF(couple?,40%,60%)","v":{"v":0.6,"d":"60%"}},{"$f":"IF(couple?,50%,70%)","v":{"v":0.7,"d":"70%"}},{"$f":"IF(couple?,60%,80%)","v":{"v":0.8,"d":"80%"}},{"$f":"IF(couple?,70%,90%)","v":{"v":0.9,"d":"90%"}}]
[]
["Years to show:",1,2,3,4,5]
["individual",10,15,20,25,30]
["couple",10,15,20,25,30]

{"sheet":"Calcs","index":4,"n_rows":160,"n_cols":20,"rows_kept":160}
["Couple?",false,null,"person1 in range",{"$f":"IF(_sex1=\"M\",AND(_age1<=age_max_M,_age1>=age_min_M),AND(_age1<=age_max_F,_age1>=age_min_F))","v":true},"mortality improvement rate",{"v":0,"d":"0.00%"}]
["2nd entered?",{"$f":"OR(AND(couple?,enter1?,enter2?),AND(NOT(couple?),enter1?))","v":true},null,"person2 in range",{"$f":"IF(_sex2=\"M\",AND(_age2<=age_max_M,_age2>=age_min_M),AND(_age2<=age_max_F,_age2>=age_min_F))","v":true},"projected future improvement",{"v":0.01,"d":"1.00%"},{"$nulls":4},"life expectancy:",{"$f":"IF(exists_2nd,SUM(M5:M160),\"\")","v":16.214281821854378},null,"Percentiles","prob","where occurs","prob","prob next","actually where"]
[null,"Person 1",{"$nulls":3},"Person2",{"$nulls":8},{"$f":"pct_1","v":0.5},{"$f":"1-O3","v":0.5},{"$f":"LOOKUP(O3,death_array,yrs_array)","v":16},{"$f":"LOOKUP(Q3,yrs_array,surv_array)","v":0.5219874591630511},{"$f":"LOOKUP(Q3+1,yrs_array,surv_array)","v":0.47887703689823385},{"$f":"IF(exists_2nd,InterpSolve(opt_interp, R3,S3,P3)+Q3,\"\")","v":16.510026532052674}]
["Year","Age","mort improvement factor","Qx","S(x)","Age","mort improvement factor","Qy","S(y)","S(x,y)","death prob","S-bar(x,y)","e-circle bit",null,{"$f":"pct_2","v":0.6},{"$f":"1-O4","v":0.4},{"$f":"LOOKUP(O4,death_array,yrs_array)","v":18},{"$f":"LOOKUP(Q4,yrs_array,surv_array)","v":0.4352345781405133},{"$f":"LOOKUP(Q4+1,yrs_array,surv_array)","v":0.39141516081332645},{"$f":"IF(exists_2nd,InterpSolve(opt_interp, R4,S4,P4)+Q4,\"\")","v":18.804085957543133}]
[0,{"$f":"_age1","v":67},{"$f":"IF(B5=\"\",\"\",mort_improve_rate)","v":0},{"$f":"IF(B5=\"\",\"\",IF(_sex1=\"M\",VLOOKUP(B5,mort_table_M,2)*(1-C5)^A5,VLOOKUP(B5,mort_table_F,2)*(1-C5)^A5))","v":0.018348},{"$f":"1","v":1},{"$f":"IF(couple?,_age2,\"\")","v":""},{"$f":"IF(F5=\"\",\"\",mort_improve_rate)","v":""},{"$f":"IF(F5=\"\",\"\",IF(_sex2=\"M\",VLOOKUP(F5,mort_table_M,2)*(1-G5)^A5,VLOOKUP(F5,mort_table_F,2)*(1-G5)^A5))","v":""},{"$f":"IF(couple?,1,0)","v":0},{"$f":"IF(OR(E5=\"\",I5=\"\"),\"\",E5*I5)","v":0},{"$f":"1-L5","v":0},{"$f":"IF(AND(E5=\"\",I5=\"\",J5=\"\"),\"\",E5+I5-J5)","v":1},{"$f":"IntegralValue(opt_interp,L5,L6)","v":0.990826},null,{"$f":"pct_3","v":0.7},{"$f":"1-O5","v":0.30000000000000004},{"$f":"LOOKUP(O5,death_array,yrs_array)","v":21},{"$f":"LOOKUP(Q5,yrs_array,surv_array)","v":0.30481700146757396},{"$f":"LOOKUP(Q5+1,yrs_array,surv_array)","v":0.26301866532433144},{"$f":"IF(exists_2nd,InterpSolve(opt_interp, R5,S5,P5)+Q5,\"\")","v":21.115243856862296}]
[{"$f":"IF(AND(B6=\"\",F6=\"\"),\"\",A5+1)","v":1},{"$f":"IF(OR(B5=\"\",AND(_sex1=\"M\",B5=age_max_M),(AND(_sex1=\"F\",B5=age_max_F))),\"\",B5+1)","v":68},0,0.019969,{"$f":"IF(B6=\"\",0,E5*(1-D5))","v":0.981652},{"$f":"IF(couple?,IF(OR(F5=\"\",AND(_sex2=\"M\",F5=age_max_M),(AND(_sex2=\"F\",F5=age_max_F))),\"\",F5+1),\"\")","v":""},"","",{"$f":"IF(F6=\"\",0,I5*(1-H5))","v":0},{"$f":"IF(OR(E6=\"\",I6=\"\"),0,E6*I6)","v":0},{"$f":"1-L6","v":0.01834800000000003},{"$f":"IF(AND(E6=\"\",I6=\"\",J6=\"\"),\"\",E6+I6-J6)","v":0.981652},{"$f":"IntegralValue(opt_interp,L6,L7)","v":0.971850695606},null,{"$f":"pct_4","v":0.8},{"$f":"1-O6","v":0.19999999999999996},{"$f":"LOOKUP(O6,death_array,yrs_array)","v":23},{"$f":"LOOKUP(Q6,yrs_array,surv_array)","v":0.22301563047782322},{"$f":"LOOKUP(Q6+1,yrs_array,surv_array)","v":0.18545399989896538},{"$f":"IF(exists_2nd,InterpSolve(opt_interp, R6,S6,P6)+Q6,\"\")","v":23.612743113734204}]
[2,{"$f":"IF(OR(B6=\"\",AND(_sex1=\"M\",B6=age_max_M),(AND(_sex1=\"F\",B6=age_max_F))),\"\",B6+1)","v":69},0,0.021766,0.962049391212,{"$f":"IF(couple?,IF(OR(F6=\"\",AND(_sex2=\"M\",F6=age_max_M),(AND(_sex2=\"F\",F6=age_max_F))),\"\",F6+1),\"\")","v":""},"","",{"$f":"IF(F7=\"\",0,I6*(1-H6))","v":0},{"$f":"IF(OR(E7=\"\",I7=\"\"),0,E7*I7)","v":0},0.03795060878800005,0.962049391212,0.9515794076874398,null,{"$f":"pct_5","v":0.9},{"$f":"1-O7","v":0.09999999999999998},{"$f":"LOOKUP(O7,death_array,yrs_array)","v":26},{"$f":"LOOKUP(Q7,yrs_array,surv_array)","v":0.12001487958145622},{"$f":"LOOKUP(Q7+1,yrs_array,surv_array)","v":0.0930198127023197},{"$f":"IF(exists_2nd,InterpSolve(opt_interp, R7,S7,P7)+Q7,\"\")","v":26.74142730118313}]
[3,70,0,0.02384,0.9411094241628796,"","","",0,0,0.05889057583712043,0.9411094241628796,0.9298913998268581,null,"Years","survival prob"]
[4,71,0,0.026162,0.9186733754908365,"","","",0,0,0.0813266245091635,0.9186733754908365,0.9066562090660408,null,{"$f":"IF(couple?,yrs_c_1,yrs_1)","v":10},{"$f":"IF(exists_2nd,LOOKUP(O9,yrs_array,surv_array),\"\")","v":0.7510112790584232}]
[5,72,0,0.028625,0.8946390426412452,"","","",0,0,0.10536095735875484,0.8946390426412452,0.8818345213434423,null,{"$f":"IF(couple?,yrs_c_2,yrs_2)","v":15},{"$f":"IF(exists_2nd,LOOKUP(O10,yrs_array,surv_array),\"\")","v":0.5641759743488866}]
[6,73,0,0.031204,0.8690300000456395,"","","",0,0,0.13096999995436054,0.8690300000456395,0.8554713939849274,null,{"$f":"IF(couple?,yrs_c_3,yrs_3)","v":20},{"$f":"IF(exists_2nd,LOOKUP(O11,yrs_array,surv_array),\"\")","v":0.3477942896316461}]
[7,74,0,0.033997,0.8419127879242153,"","","",0,0,0.1580872120757847,0.8419127879242153,0.8276015333986855,null,{"$f":"IF(couple?,yrs_c_4,yrs_4)","v":25},{"$f":"IF(exists_2nd,LOOKUP(O12,yrs_array,surv_array),\"\")","v":0.1509478723157642}]
[8,75,0,0.0372,0.8132902788731557,"","","",0,0,0.18670972112684425,0.8132902788731557,0.798163079686115,null,{"$f":"IF(couple?,yrs_c_5,yrs_5)","v":30},{"$f":"IF(exists_2nd,LOOKUP(O13,yrs_array,surv_array),\"\")","v":0.03665043286508025}]
[9,76,0,0.040898,0.7830358804990744,"","","",0,0,0.21696411950092565,0.7830358804990744,0.7670235797787488]
[10,77,0,0.04504,0.7510112790584232,"","","",0,0,0.24898872094157676,0.7510112790584232,0.7340985050540276,null,"future years","Display?",null,"Display current option?"]
[11,78,0,0.049664,0.7171857310496319,"","","",0,0,0.2828142689503681,0.7171857310496319,0.6993765749762074,null,{"$f":"IF(couple?,MIN(_age1,_age2),_age1)+O9","v":77},{"$f":"O16<=AGE_MAX","v":true},null,{"$f":"IF(opt_display=\"pct\",P23,P16)","v":true}]
[12,79,0,0.054844,0.6815674189027829,"","","",0,0,0.31843258109721706,0.6815674189027829,0.6628774771416308,null,{"$f":"IF(couple?,MIN(_age1,_age2),_age1)+O10","v":82},{"$f":"O17<=AGE_MAX","v":true},null,{"$f":"IF(opt_display=\"pct\",P24,P17)","v":true}]
[13,80,0,0.060801,0.6441875353804787,"","","",0,0,0.3558124646195213,0.6441875353804787,0.6246039122111444,null,{"$f":"IF(couple?,MIN(_age1,_age2),_age1)+O11","v":87},{"$f":"O18<=AGE_MAX","v":true},null,{"$f":"IF(opt_display=\"pct\",P25,P18)","v":true}]
[14,81,0,0.067509,0.6050202890418102,"","","",0,0,0.39497971095818984,0.6050202890418102,0.5845981316953484,null,{"$f":"IF(couple?,MIN(_age1,_age2),_age1)+O12","v":92},{"$f":"O19<=AGE_MAX","v":true},null,{"$f":"IF(opt_display=\"pct\",P26,P19)","v":true}]
[15,82,0,0.074779,0.5641759743488866,"","","",0,0,0.43582402565111344,0.5641759743488866,0.5430817167559688,null,{"$f":"IF(couple?,MIN(_age1,_age2),_age1)+O13","v":97},{"$f":"O20<=AGE_MAX","v":false},null,{"$f":"IF(opt_display=\"pct\",P27,P20)","v":true}]
{"$rows_left_out":141}
{"sheet":"working tables","index":5,"n_rows":140,"n_cols":10,"rows_kept":140,"hidden":true}
[null,"Male mortality table:",null,"New Male Mortality Table",null,null,"Female mortality table:",null,"New Female Mortality Table"]
[null,{"$f":"opt_table_M","v":"SSM"},null,"min age:",{"$f":"MIN(D5:D140)","v":6},null,{"$f":"opt_table_F","v":"SSF"},null,"min age:",{"$f":"MIN(I5:I140)","v":6}]
[{"$nulls":3},"max age:",{"$f":"MAX(D6:D141)","v":140},{"$nulls":3},"max age:",{"$f":"MAX(I6:I141)","v":140}]
["Age:","q_x","q_(x-1)","New age","qnew_x","Age:","q_x","q_(x-1)"]
[{"$f":"'Mortality tables'!C3","v":5},{"$f":"HLOOKUP(opt_table_M,MORT_TABLES,A5-2,FALSE)","v":0.000158},null,null,{"$f":"B5","v":0.000158},{"$f":"'Mortality tables'!C3","v":5},{"$f":"HLOOKUP(opt_table_F,MORT_TABLES,A5-2,FALSE)","v":1.27E-4},null,null,{"$f":"G5","v":1.27E-4}]
[{"$f":"'Mortality tables'!C4","v":6},{"$f":"HLOOKUP(opt_table_M,MORT_TABLES,A6-2,FALSE)","v":1.47E-4},{"$f":"B5","v":0.000158},{"$f":"A6+setback_yrs_M","v":6},{"$f":"B6","v":1.47E-4},{"$f":"'Mortality tables'!C4","v":6},1.16E-4,{"$f":"G5","v":1.27E-4},{"$f":"F6+setback_yrs_F","v":6},{"$f":"G6","v":1.16E-4}]
[{"$f":"'Mortality tables'!C5","v":7},1.36E-4,{"$f":"B6","v":1.47E-4},7,1.36E-4,{"$f":"'Mortality tables'!C5","v":7},1.06E-4,{"$f":"G6","v":1.16E-4},7,1.06E-4]
[{"$f":"'Mortality tables'!C6","v":8},1.21E-4,1.36E-4,8,1.21E-4,{"$f":"'Mortality tables'!C6","v":8},9.8e-05,1.06E-4,8,9.8e-05]
[{"$f":"'Mortality tables'!C7","v":9},0.000104,1.21E-4,9,0.000104,{"$f":"'Mortality tables'!C7","v":9},9.1e-05,9.8e-05,9,9.1e-05]
[{"$f":"'Mortality tables'!C8","v":10},9.2E-5,0.000104,10,9.2E-5,{"$f":"'Mortality tables'!C8","v":10},8.6e-05,9.1e-05,10,8.6e-05]
[{"$f":"'Mortality tables'!C9","v":11},9.7E-5,9.2E-5,11,9.7E-5,{"$f":"'Mortality tables'!C9","v":11},8.9e-05,8.6e-05,11,8.9e-05]
[{"$f":"'Mortality tables'!C10","v":12},1.34E-4,9.7E-5,12,1.34E-4,{"$f":"'Mortality tables'!C10","v":12},1.02E-4,8.9e-05,12,1.02E-4]
[{"$f":"'Mortality tables'!C11","v":13},0.00021,1.34E-4,13,0.00021,{"$f":"'Mortality tables'!C11","v":13},0.000128,1.02E-4,13,0.000128]
[{"$f":"'Mortality tables'!C12","v":14},0.000317,0.00021,14,0.000317,{"$f":"'Mortality tables'!C12","v":14},1.64E-4,0.000128,14,1.64E-4]
[{"$f":"'Mortality tables'!C13","v":15},0.000433,0.000317,15,0.000433,{"$f":"'Mortality tables'!C13","v":15},2.05E-4,1.64E-4,15,2.05E-4]
[{"$f":"'Mortality tables'!C14","v":16},0.000547,0.000433,16,0.000547,{"$f":"'Mortality tables'!C14","v":16},0.000246,2.05E-4,16,0.000246]
[{"$f":"'Mortality tables'!C15","v":17},0.000672,0.000547,17,0.000672,{"$f":"'Mortality tables'!C15","v":17},0.000285,0.000246,17,0.000285]
[{"$f":"'Mortality tables'!C16","v":18},0.000805,0.000672,18,0.000805,{"$f":"'Mortality tables'!C16","v":18},3.19E-4,0.000285,18,3.19E-4]
[{"$f":"'Mortality tables'!C17","v":19},9.41E-4,0.000805,19,9.41E-4,{"$f":"'Mortality tables'!C17","v":19},3.5E-4,3.19E-4,19,3.5E-4]
[{"$f":"'Mortality tables'!C18","v":20},0.001084,9.41E-4,20,0.001084,{"$f":"'Mortality tables'!C18","v":20},0.000383,3.5E-4,20,0.000383]
{"$rows_left_out":121}
{"sheet":"Mortality tables","index":6,"n_rows":138,"n_cols":7,"rows_kept":138}
[null,"Min age:",null,"2582","2581","SSM","SSF"]
[null,5,null,"2012 IAM Basic Table – Female, ANB","2012 IAM Basic Table – Male, ANB","Soc. Sec. 2011-Male","Soc. Sec. 2011-Female"]
[null,"Max age:",5,"0.000139","0.000186",0.000158,1.27E-4]
[null,95,6,"0.00013","0.000184",1.47E-4,1.16E-4]
[null,null,7,"0.000122","0.000177",1.36E-4,1.06E-4]
["Number","Table name",8,"0.000105","0.000159",1.21E-4,9.8e-05]
[{"$f":"TRANSPOSE(D1:G2)","v":"2582"},"2012 IAM Basic Table – Female, ANB",9,"9.8E-05","0.000143",0.000104,9.1e-05]
["2581","2012 IAM Basic Table – Male, ANB",10,"9.4E-05","0.000126",9.2E-5,8.6e-05]
["SSM","Soc. Sec. 2011-Male",11,"9.6E-05","0.000123",9.7E-5,8.9e-05]
["SSF","Soc. Sec. 2011-Female",12,"0.000105","0.000147",1.34E-4,1.02E-4]
[null,null,13,"0.00012","0.000188",0.00021,0.000128]
[null,null,14,"0.000146","0.000236",0.000317,1.64E-4]
[null,null,15,"0.000174","0.000282",0.000433,2.05E-4]
[null,null,16,"0.000199","0.000325",0.000547,0.000246]
[null,null,17,"0.00022","0.000364",0.000672,0.000285]
[null,null,18,"0.000234","0.000399",0.000805,3.19E-4]
[null,null,19,"0.000245","0.00043",9.41E-4,3.5E-4]
[null,null,20,"0.000253","0.000459",0.001084,0.000383]
[null,null,21,"0.00026","0.000492",1.219E-3,4.17E-4]
[null,null,22,"0.000266","0.000526",0.001314,4.46E-4]
{"$rows_left_out":119}
{"sheet":"Notes","index":7,"n_rows":26,"n_cols":2,"rows_kept":26,"merged":[[7,5,10,5],[11,0,11,5],[12,0,12,5],[13,0,13,5]]}
["date","2014-05-23"]
["by","Mary Pat Campbell"]
[null,"marypat.campbell@gmail.com"]
[]
[]
["Table Source, Social Security"]
["Actuarial Study No. 120, published August 2005"]
["Life Tables for the"]
["United States Social Security"]
["Area 1900-2100"]
[]
["ACTUARIAL STUDY NO. 120 "]
["by Felicitie C. Bell"]
["and Michael L. Miller"]
[]
["Table 6 -- Calendar Year 2010"]
["http://www.ssa.gov/oact/NOTES/as120/LifeTables_Tbl_6_2010.html"]
[]
[]
[]
{"$rows_left_out":7}
{"sheet":"Version control","index":8,"n_rows":13,"n_cols":2,"rows_kept":13}
["Version","Notes"]
["1.0","Original"]
["1.01","Fixed VBA code for explanations of results form"]
["1.5","Added: mortality improvement, explanations of methods, new Social Security table (not that different from before), printable explanations sheet "]
["1.6","Looking at projection scale G"]
["1.7 ","Implemented projection scale G, looking at calculation comparisons"]
["1.8","Removed projection scale G stuff, explanation sheet wording edited, cleaning up VBA"]
["1.8.1","Fixed text areas on \"Printable Explanations\" sheet and ExplanationForm user form"]
["2.0","Switched out 2000 Soc. Sec. Table, replaced with 2010 table; explanations updated; input changed"]
["2.1","Updated links, fixed code for recalculation"]
["2.1.0","Added a file name in display page, content management policy for SOA, converted to .xlsm, removed setback stuff as it wasn't being used"]
["3.0","New mortality table for annuitants, added notes page to document data sources, remove unused names, unhid sheet tabs, removed all sheet protection"]
[3.1,"Updated Soc. Sec. Table with 2011 data"]